{"text_format":"1","workbook":"xlsx","n_sheets":5,"sheets":["Instructions","Diet","Plot","Database","Week"],"not_rendered":{"charts":3,"images":2,"macros":1,"external_links":1,"defined_names":46,"comments":0,"pivot_tables":0},"unopened":[],"bounds":{"document_bytes":16777216,"sheet_cells":100000,"rows_first":2000,"rows_last":500,"rows_between":2000,"halvings":0,"cell_chars":16384,"cell_head_chars":4096},"cells_cut":0,"cells_raw":0,"read":"whole","date_system":"1900"}

{"sheet":"Instructions","index":0,"n_rows":0,"n_cols":0,"rows_kept":0,"cut":false,"hidden":false,"merged":[]}

{"sheet":"Diet","index":1,"n_rows":75,"n_cols":24,"rows_kept":75,"cut":false,"hidden":false,"merged":[[37,3,37,7],[3,23,4,23],[3,10,3,14],[3,15,4,15],[3,16,4,16],[3,17,4,17],[3,18,3,22],[36,3,36,7],[3,8,4,8],[3,9,4,9],[3,5,4,5],[3,7,4,7],[3,3,4,3],[2,1,2,5],[50,19,50,22],[31,1,37,1],[31,2,37,2],[37,8,37,9],[45,1,50,1],[45,2,50,2],[49,3,49,7],[50,3,50,7],[30,1,30,23],[3,1,4,1],[3,2,4,2],[3,4,4,4],[3,6,4,6],[38,1,44,1],[27,3,27,7],[5,1,28,2],[28,8,28,9],[28,11,28,17],[28,19,28,22],[28,3,28,7],[44,8,44,9],[44,11,44,17],[44,19,44,22],[51,1,56,1],[51,2,56,2],[55,3,55,7],[56,3,56,7],[56,8,56,9],[56,11,56,17],[38,2,44,2],[43,3,43,7],[44,3,44,7],[57,1,62,1],[57,2,62,2],[61,3,61,7],[62,3,62,7],[62,8,62,9],[63,1,67,1],[63,2,67,2],[66,3,66,7],[67,3,67,7],[67,8,67,9],[73,1,74,4],[74,11,74,17],[68,1,72,1],[68,2,72,2],[71,3,71,7],[72,3,72,7],[72,8,72,9],[72,11,72,17],[1,5,1,6],[0,22,2,24],[72,19,72,22],[73,5,73,7],[74,19,74,22],[74,8,74,9],[74,5,74,7],[62,19,62,22],[67,11,67,17],[67,19,67,22],[62,11,62,17],[56,19,56,22],[37,11,37,17],[50,11,50,17],[37,19,37,22],[50,8,50,9]]}
[null,null,null,null,null,null,null,null,null,null,null,null,null,null,null,null,null,null,null,null,null,null,"Created by:\nLucas Taylor"]
[null,null,null,null,null,"DIET PLANNER",null,"v.2.2"]
[]
[null,"Date","Day","Time","Category","Item","QTY","Base \nUnit","Total \nCalories","Fat \nCalories","Fat",null,null,null,null,"Cholesterol\n(mg)","Sodium\n(mg)","Potassium\n(mg)","Carbs",null,null,null,null,"Protein\n(g)"]
[null,null,null,null,null,null,null,null,null,null,"Total \n(g)","Sat. \n(g)","P.Unsat. \n(g)","M.Unsat. \n(g)","Trans \n(g)",null,null,null,"Total \n(g)","Fiber \n(g)","Sol. \n(g)","Insol. \n(g)","Sugar \n(g)"]
[null,"STANDARD DAY",null,"08:00:00","Beverage","Coffee",1,{"$f":"IF(Item=\"\",\"\",VLOOKUP(Item,Food,Database!C$1,FALSE))","v":"8 oz"},{"$f":"IF(OR(Item=\"\",Qty=\"\"),\"\",Qty*VLOOKUP(Item,Food,Database!D$1,FALSE))","v":2},{"$f":"IF(OR(Item=\"\",Qty=\"\"),\"\",Qty*VLOOKUP(Item,Food,Database!E$1,FALSE))","v":0},{"$f":"IF(OR(Item=\"\",Qty=\"\"),\"\",Qty*VLOOKUP(Item,Food,Database!F$1,FALSE))","v":0},{"$f":"IF(OR(Item=\"\",Qty=\"\"),\"\",Qty*VLOOKUP(Item,Food,Database!G$1,FALSE))","v":0},{"$f":"IF(OR(Item=\"\",Qty=\"\"),\"\",Qty*VLOOKUP(Item,Food,Database!H$1,FALSE))","v":0},{"$f":"IF(OR(Item=\"\",Qty=\"\"),\"\",Qty*VLOOKUP(Item,Food,Database!I$1,FALSE))","v":0},{"$f":"IF(OR(Item=\"\",Qty=\"\"),\"\",Qty*VLOOKUP(Item,Food,Database!J$1,FALSE))","v":0},{"$f":"IF(OR(Item=\"\",Qty=\"\"),\"\",Qty*VLOOKUP(Item,Food,Database!K$1,FALSE))","v":0},{"$f":"IF(OR(Item=\"\",Qty=\"\"),\"\",Qty*VLOOKUP(Item,Food,Database!L$1,FALSE))","v":0},{"$f":"IF(OR(Item=\"\",Qty=\"\"),\"\",Qty*VLOOKUP(Item,Food,Database!M$1,FALSE))","v":0},{"$f":"IF(OR(Item=\"\",Qty=\"\"),\"\",Qty*VLOOKUP(Item,Food,Database!N$1,FALSE))","v":0},{"$f":"IF(OR(Item=\"\",Qty=\"\"),\"\",Qty*VLOOKUP(Item,Food,Database!O$1,FALSE))","v":0},{"$f":"IF(OR(Item=\"\",Qty=\"\"),\"\",Qty*VLOOKUP(Item,Food,Database!P$1,FALSE))","v":0},{"$f":"IF(OR(Item=\"\",Qty=\"\"),\"\",Qty*VLOOKUP(Item,Food,Database!Q$1,FALSE))","v":0},{"$f":"IF(OR(Item=\"\",Qty=\"\"),\"\",Qty*VLOOKUP(Item,Food,Database!R$1,FALSE))","v":0},{"$f":"IF(OR(Item=\"\",Qty=\"\"),\"\",Qty*VLOOKUP(Item,Food,Database!S$1,FALSE))","v":0}]
[null,null,null,null,"Supplement","Syntha-6",1,{"$f":"IF(Item=\"\",\"\",VLOOKUP(Item,Food,Database!C$1,FALSE))","v":"1 scoop (44 g)"},{"$f":"IF(OR(Item=\"\",Qty=\"\"),\"\",Qty*VLOOKUP(Item,Food,Database!D$1,FALSE))","v":200},{"$f":"IF(OR(Item=\"\",Qty=\"\"),\"\",Qty*VLOOKUP(Item,Food,Database!E$1,FALSE))","v":54},{"$f":"IF(OR(Item=\"\",Qty=\"\"),\"\",Qty*VLOOKUP(Item,Food,Database!F$1,FALSE))","v":6},{"$f":"IF(OR(Item=\"\",Qty=\"\"),\"\",Qty*VLOOKUP(Item,Food,Database!G$1,FALSE))","v":2},{"$f":"IF(OR(Item=\"\",Qty=\"\"),\"\",Qty*VLOOKUP(Item,Food,Database!H$1,FALSE))","v":0},{"$f":"IF(OR(Item=\"\",Qty=\"\"),\"\",Qty*VLOOKUP(Item,Food,Database!I$1,FALSE))","v":0},{"$f":"IF(OR(Item=\"\",Qty=\"\"),\"\",Qty*VLOOKUP(Item,Food,Database!J$1,FALSE))","v":0},{"$f":"IF(OR(Item=\"\",Qty=\"\"),\"\",Qty*VLOOKUP(Item,Food,Database!K$1,FALSE))","v":55},{"$f":"IF(OR(Item=\"\",Qty=\"\"),\"\",Qty*VLOOKUP(Item,Food,Database!L$1,FALSE))","v":220},{"$f":"IF(OR(Item=\"\",Qty=\"\"),\"\",Qty*VLOOKUP(Item,Food,Database!M$1,FALSE))","v":170},{"$f":"IF(OR(Item=\"\",Qty=\"\"),\"\",Qty*VLOOKUP(Item,Food,Database!N$1,FALSE))","v":15},{"$f":"IF(OR(Item=\"\",Qty=\"\"),\"\",Qty*VLOOKUP(Item,Food,Database!O$1,FALSE))","v":5},{"$f":"IF(OR(Item=\"\",Qty=\"\"),\"\",Qty*VLOOKUP(Item,Food,Database!P$1,FALSE))","v":0},{"$f":"IF(OR(Item=\"\",Qty=\"\"),\"\",Qty*VLOOKUP(Item,Food,Database!Q$1,FALSE))","v":0},{"$f":"IF(OR(Item=\"\",Qty=\"\"),\"\",Qty*VLOOKUP(Item,Food,Database!R$1,FALSE))","v":2},{"$f":"IF(OR(Item=\"\",Qty=\"\"),\"\",Qty*VLOOKUP(Item,Food,Database!S$1,FALSE))","v":22}]
[null,null,null,null,"Dairy","Milk, Non-Fat ",1,{"$f":"IF(Item=\"\",\"\",VLOOKUP(Item,Food,Database!C$1,FALSE))","v":"1 cup (8 oz)"},{"$f":"IF(OR(Item=\"\",Qty=\"\"),\"\",Qty*VLOOKUP(Item,Food,Database!D$1,FALSE))","v":90},{"$f":"IF(OR(Item=\"\",Qty=\"\"),\"\",Qty*VLOOKUP(Item,Food,Database!E$1,FALSE))","v":0},{"$f":"IF(OR(Item=\"\",Qty=\"\"),\"\",Qty*VLOOKUP(Item,Food,Database!F$1,FALSE))","v":0},{"$f":"IF(OR(Item=\"\",Qty=\"\"),\"\",Qty*VLOOKUP(Item,Food,Database!G$1,FALSE))","v":0},{"$f":"IF(OR(Item=\"\",Qty=\"\"),\"\",Qty*VLOOKUP(Item,Food,Database!H$1,FALSE))","v":0},{"$f":"IF(OR(Item=\"\",Qty=\"\"),\"\",Qty*VLOOKUP(Item,Food,Database!I$1,FALSE))","v":0},{"$f":"IF(OR(Item=\"\",Qty=\"\"),\"\",Qty*VLOOKUP(Item,Food,Database!J$1,FALSE))","v":0},{"$f":"IF(OR(Item=\"\",Qty=\"\"),\"\",Qty*VLOOKUP(Item,Food,Database!K$1,FALSE))","v":4.9000000000000004},{"$f":"IF(OR(Item=\"\",Qty=\"\"),\"\",Qty*VLOOKUP(Item,Food,Database!L$1,FALSE))","v":125},{"$f":"IF(OR(Item=\"\",Qty=\"\"),\"\",Qty*VLOOKUP(Item,Food,Database!M$1,FALSE))","v":0},{"$f":"IF(OR(Item=\"\",Qty=\"\"),\"\",Qty*VLOOKUP(Item,Food,Database!N$1,FALSE))","v":13},{"$f":"IF(OR(Item=\"\",Qty=\"\"),\"\",Qty*VLOOKUP(Item,Food,Database!O$1,FALSE))","v":0},{"$f":"IF(OR(Item=\"\",Qty=\"\"),\"\",Qty*VLOOKUP(Item,Food,Database!P$1,FALSE))","v":0},{"$f":"IF(OR(Item=\"\",Qty=\"\"),\"\",Qty*VLOOKUP(Item,Food,Database!Q$1,FALSE))","v":0},{"$f":"IF(OR(Item=\"\",Qty=\"\"),\"\",Qty*VLOOKUP(Item,Food,Database!R$1,FALSE))","v":12},{"$f":"IF(OR(Item=\"\",Qty=\"\"),\"\",Qty*VLOOKUP(Item,Food,Database!S$1,FALSE))","v":8}]
{"$rows_left_out":68}
{"sheet":"Plot","index":2,"n_rows":8,"n_cols":9,"rows_kept":8,"cut":false,"hidden":false,"merged":[]}
["Date","Calories","Fat (g)","Carbs (g)","Protein (g)","Fiber (g)","Fat %","Carbs %","Protein %"]
["2011-02-07"]
["2011-02-08"]
["2011-02-09"]
["2011-02-10"]
["2011-02-11"]
["2011-02-12"]
["2011-02-13"]
{"$rows_left_out":1}
{"sheet":"Database","index":3,"n_rows":211,"n_cols":19,"rows_kept":211,"cut":false,"hidden":false,"merged":[[14,1,14,7],[14,8,14,18],[17,1,18,1],[17,2,18,2],[17,3,18,3],[17,4,18,4],[17,5,17,9],[17,10,18,10],[17,11,18,11],[17,12,18,12],[17,13,17,17],[17,18,18,18],[16,1,16,18],[35,1,35,18],[36,1,37,1],[36,2,37,2],[36,3,37,3],[36,4,37,4],[59,10,60,10],[59,11,60,11],[59,12,60,12],[59,13,59,17],[59,18,60,18],[98,1,98,18],[36,5,36,9],[36,10,37,10],[36,11,37,11],[36,12,37,12],[58,1,58,18],[59,1,60,1],[59,2,60,2],[59,3,60,3],[59,4,60,4],[59,5,59,9],[36,13,36,17],[36,18,37,18],[99,11,100,11],[99,12,100,12],[99,13,99,17],[99,18,100,18],[133,1,133,18],[134,1,135,1],[134,2,135,2],[134,3,135,3],[134,4,135,4],[134,5,134,9],[99,1,100,1],[99,2,100,2],[99,3,100,3],[99,4,100,4],[99,5,99,9],[99,10,100,10],[134,10,135,10],[134,11,135,11],[134,12,135,12],[134,13,134,17],[134,18,135,18],[190,1,190,18],[161,1,162,1],[161,2,162,2],[161,3,162,3],[161,4,162,4],[145,1,145,18],[146,1,147,1],[146,2,147,2],[146,3,147,3],[146,4,147,4],[146,5,146,9],[161,5,161,9],[161,10,162,10],[161,13,161,17],[146,10,147,10],[146,11,147,11],[161,18,162,18],[146,12,147,12],[146,13,146,17],[146,18,147,18],[160,1,160,18],[179,4,180,4],[179,5,179,9],[179,11,180,11],[179,10,180,10],[161,11,162,11],[161,12,162,12],[170,1,170,18],[171,1,172,1],[171,2,172,2],[171,3,172,3],[171,4,172,4],[171,5,171,9],[171,10,172,10],[171,11,172,11],[171,12,172,12],[171,13,171,17],[171,18,172,18],[178,1,178,18],[179,1,180,1],[179,2,180,2],[179,3,180,3],[179,12,180,12],[205,12,206,12],[205,13,205,17],[205,18,206,18],[179,13,179,17],[179,18,180,18],[204,1,204,18],[205,1,206,1],[205,2,206,2],[205,3,206,3],[205,4,206,4],[205,5,205,9],[205,10,206,10],[205,11,206,11],[191,11,192,11],[191,12,192,12],[191,13,191,17],[191,18,192,18],[191,1,192,1],[191,2,192,2],[191,3,192,3],[191,4,192,4],[191,5,191,9],[191,10,192,10]]}
[null,1,2,3,4,5,6,7,8,9,10,11,12,13,14,15,16,17,18]
[]
[null,"Fruit",1,"Mon"]
[null,"Vegetable",2,"Tue"]
[null,"Starch",3,"Wed"]
[null,"Protein",4,"Thu"]
[null,"Dairy",5,"Fri"]
[null,"Nut",6,"Sat"]
{"$rows_left_out":204}
{"sheet":"Week","index":4,"n_rows":88,"n_cols":24,"rows_kept":88,"cut":false,"hidden":true,"merged":[[85,11,85,17],[85,19,85,22],[87,19,87,22],[86,1,87,4],[86,5,86,7],[87,5,87,7],[87,8,87,9],[87,11,87,17],[74,1,85,1],[74,2,85,2],[84,3,84,7],[85,3,85,7],[85,8,85,9],[61,11,61,17],[61,19,61,22],[38,1,49,1],[38,2,49,2],[62,1,73,1],[62,2,73,2],[72,3,72,7],[73,3,73,7],[49,8,49,9],[49,11,49,17],[73,8,73,9],[73,11,73,17],[73,19,73,22],[50,1,61,1],[50,2,61,2],[60,3,60,7],[61,3,61,7],[61,8,61,9],[48,3,48,7],[49,3,49,7],[25,8,25,9],[49,19,49,22],[37,11,37,17],[37,19,37,22],[14,1,25,1],[14,2,25,2],[24,3,24,7],[25,3,25,7],[26,1,37,1],[26,2,37,2],[25,11,25,17],[25,19,25,22],[36,3,36,7],[37,3,37,7],[37,8,37,9],[1,1,1,23],[2,1,13,1],[2,2,13,2],[12,3,12,7],[13,3,13,7],[13,8,13,9],[13,11,13,17],[13,19,13,22]]}
[]
[null,9]
[null,"2008-09-29",{"$f":"VLOOKUP(WEEKDAY(B3,2),WkDay,2,FALSE)","v":"Mon"},null,null,null,null,{"$f":"IF(Item=\"\",\"\",VLOOKUP(Item,Food,Database!C$1,FALSE))","v":""},{"$f":"IF(OR(Item=\"\",Qty=\"\"),\"\",Qty*VLOOKUP(Item,Food,Database!D$1,FALSE))","v":""},{"$f":"IF(OR(Item=\"\",Qty=\"\"),\"\",Qty*VLOOKUP(Item,Food,Database!E$1,FALSE))","v":""},{"$f":"IF(OR(Item=\"\",Qty=\"\"),\"\",Qty*VLOOKUP(Item,Food,Database!F$1,FALSE))","v":""},{"$f":"IF(OR(Item=\"\",Qty=\"\"),\"\",Qty*VLOOKUP(Item,Food,Database!G$1,FALSE))","v":""},{"$f":"IF(OR(Item=\"\",Qty=\"\"),\"\",Qty*VLOOKUP(Item,Food,Database!H$1,FALSE))","v":""},{"$f":"IF(OR(Item=\"\",Qty=\"\"),\"\",Qty*VLOOKUP(Item,Food,Database!I$1,FALSE))","v":""},{"$f":"IF(OR(Item=\"\",Qty=\"\"),\"\",Qty*VLOOKUP(Item,Food,Database!J$1,FALSE))","v":""},{"$f":"IF(OR(Item=\"\",Qty=\"\"),\"\",Qty*VLOOKUP(Item,Food,Database!K$1,FALSE))","v":""},{"$f":"IF(OR(Item=\"\",Qty=\"\"),\"\",Qty*VLOOKUP(Item,Food,Database!L$1,FALSE))","v":""},{"$f":"IF(OR(Item=\"\",Qty=\"\"),\"\",Qty*VLOOKUP(Item,Food,Database!M$1,FALSE))","v":""},{"$f":"IF(OR(Item=\"\",Qty=\"\"),\"\",Qty*VLOOKUP(Item,Food,Database!N$1,FALSE))","v":""},{"$f":"IF(OR(Item=\"\",Qty=\"\"),\"\",Qty*VLOOKUP(Item,Food,Database!O$1,FALSE))","v":""},{"$f":"IF(OR(Item=\"\",Qty=\"\"),\"\",Qty*VLOOKUP(Item,Food,Database!P$1,FALSE))","v":""},{"$f":"IF(OR(Item=\"\",Qty=\"\"),\"\",Qty*VLOOKUP(Item,Food,Database!Q$1,FALSE))","v":""},{"$f":"IF(OR(Item=\"\",Qty=\"\"),\"\",Qty*VLOOKUP(Item,Food,Database!R$1,FALSE))","v":""},{"$f":"IF(OR(Item=\"\",Qty=\"\"),\"\",Qty*VLOOKUP(Item,Food,Database!S$1,FALSE))","v":""}]
[null,null,null,null,null,null,null,{"$f":"IF(Item=\"\",\"\",VLOOKUP(Item,Food,Database!C$1,FALSE))","v":"Base \nUnit"},{"$f":"IF(OR(Item=\"\",Qty=\"\"),\"\",Qty*VLOOKUP(Item,Food,Database!D$1,FALSE))","v":{"$error":"#VALUE!"}},{"$f":"IF(OR(Item=\"\",Qty=\"\"),\"\",Qty*VLOOKUP(Item,Food,Database!E$1,FALSE))","v":{"$error":"#VALUE!"}},{"$f":"IF(OR(Item=\"\",Qty=\"\"),\"\",Qty*VLOOKUP(Item,Food,Database!F$1,FALSE))","v":{"$error":"#VALUE!"}},{"$f":"IF(OR(Item=\"\",Qty=\"\"),\"\",Qty*VLOOKUP(Item,Food,Database!G$1,FALSE))","v":{"$error":"#VALUE!"}},{"$f":"IF(OR(Item=\"\",Qty=\"\"),\"\",Qty*VLOOKUP(Item,Food,Database!H$1,FALSE))","v":{"$error":"#VALUE!"}},{"$f":"IF(OR(Item=\"\",Qty=\"\"),\"\",Qty*VLOOKUP(Item,Food,Database!I$1,FALSE))","v":{"$error":"#VALUE!"}},{"$f":"IF(OR(Item=\"\",Qty=\"\"),\"\",Qty*VLOOKUP(Item,Food,Database!J$1,FALSE))","v":{"$error":"#VALUE!"}},{"$f":"IF(OR(Item=\"\",Qty=\"\"),\"\",Qty*VLOOKUP(Item,Food,Database!K$1,FALSE))","v":{"$error":"#VALUE!"}},{"$f":"IF(OR(Item=\"\",Qty=\"\"),\"\",Qty*VLOOKUP(Item,Food,Database!L$1,FALSE))","v":{"$error":"#VALUE!"}},{"$f":"IF(OR(Item=\"\",Qty=\"\"),\"\",Qty*VLOOKUP(Item,Food,Database!M$1,FALSE))","v":{"$error":"#VALUE!"}},{"$f":"IF(OR(Item=\"\",Qty=\"\"),\"\",Qty*VLOOKUP(Item,Food,Database!N$1,FALSE))","v":{"$error":"#VALUE!"}},{"$f":"IF(OR(Item=\"\",Qty=\"\"),\"\",Qty*VLOOKUP(Item,Food,Database!O$1,FALSE))","v":{"$error":"#VALUE!"}},{"$f":"IF(OR(Item=\"\",Qty=\"\"),\"\",Qty*VLOOKUP(Item,Food,Database!P$1,FALSE))","v":{"$error":"#VALUE!"}},{"$f":"IF(OR(Item=\"\",Qty=\"\"),\"\",Qty*VLOOKUP(Item,Food,Database!Q$1,FALSE))","v":{"$error":"#VALUE!"}},{"$f":"IF(OR(Item=\"\",Qty=\"\"),\"\",Qty*VLOOKUP(Item,Food,Database!R$1,FALSE))","v":{"$error":"#VALUE!"}},{"$f":"IF(OR(Item=\"\",Qty=\"\"),\"\",Qty*VLOOKUP(Item,Food,Database!S$1,FALSE))","v":{"$error":"#VALUE!"}}]
[null,null,null,null,null,null,null,{"$f":"IF(Item=\"\",\"\",VLOOKUP(Item,Food,Database!C$1,FALSE))","v":""},{"$f":"IF(OR(Item=\"\",Qty=\"\"),\"\",Qty*VLOOKUP(Item,Food,Database!D$1,FALSE))","v":""},{"$f":"IF(OR(Item=\"\",Qty=\"\"),\"\",Qty*VLOOKUP(Item,Food,Database!E$1,FALSE))","v":""},{"$f":"IF(OR(Item=\"\",Qty=\"\"),\"\",Qty*VLOOKUP(Item,Food,Database!F$1,FALSE))","v":""},{"$f":"IF(OR(Item=\"\",Qty=\"\"),\"\",Qty*VLOOKUP(Item,Food,Database!G$1,FALSE))","v":""},{"$f":"IF(OR(Item=\"\",Qty=\"\"),\"\",Qty*VLOOKUP(Item,Food,Database!H$1,FALSE))","v":""},{"$f":"IF(OR(Item=\"\",Qty=\"\"),\"\",Qty*VLOOKUP(Item,Food,Database!I$1,FALSE))","v":""},{"$f":"IF(OR(Item=\"\",Qty=\"\"),\"\",Qty*VLOOKUP(Item,Food,Database!J$1,FALSE))","v":""},{"$f":"IF(OR(Item=\"\",Qty=\"\"),\"\",Qty*VLOOKUP(Item,Food,Database!K$1,FALSE))","v":""},{"$f":"IF(OR(Item=\"\",Qty=\"\"),\"\",Qty*VLOOKUP(Item,Food,Database!L$1,FALSE))","v":""},{"$f":"IF(OR(Item=\"\",Qty=\"\"),\"\",Qty*VLOOKUP(Item,Food,Database!M$1,FALSE))","v":""},{"$f":"IF(OR(Item=\"\",Qty=\"\"),\"\",Qty*VLOOKUP(Item,Food,Database!N$1,FALSE))","v":""},{"$f":"IF(OR(Item=\"\",Qty=\"\"),\"\",Qty*VLOOKUP(Item,Food,Database!O$1,FALSE))","v":""},{"$f":"IF(OR(Item=\"\",Qty=\"\"),\"\",Qty*VLOOKUP(Item,Food,Database!P$1,FALSE))","v":""},{"$f":"IF(OR(Item=\"\",Qty=\"\"),\"\",Qty*VLOOKUP(Item,Food,Database!Q$1,FALSE))","v":""},{"$f":"IF(OR(Item=\"\",Qty=\"\"),\"\",Qty*VLOOKUP(Item,Food,Database!R$1,FALSE))","v":""},{"$f":"IF(OR(Item=\"\",Qty=\"\"),\"\",Qty*VLOOKUP(Item,Food,Database!S$1,FALSE))","v":""}]
[null,null,null,null,null,null,null,{"$f":"IF(Item=\"\",\"\",VLOOKUP(Item,Food,Database!C$1,FALSE))","v":"8 oz"},{"$f":"IF(OR(Item=\"\",Qty=\"\"),\"\",Qty*VLOOKUP(Item,Food,Database!D$1,FALSE))","v":2},{"$f":"IF(OR(Item=\"\",Qty=\"\"),\"\",Qty*VLOOKUP(Item,Food,Database!E$1,FALSE))","v":0},{"$f":"IF(OR(Item=\"\",Qty=\"\"),\"\",Qty*VLOOKUP(Item,Food,Database!F$1,FALSE))","v":0},{"$f":"IF(OR(Item=\"\",Qty=\"\"),\"\",Qty*VLOOKUP(Item,Food,Database!G$1,FALSE))","v":0},{"$f":"IF(OR(Item=\"\",Qty=\"\"),\"\",Qty*VLOOKUP(Item,Food,Database!H$1,FALSE))","v":0},{"$f":"IF(OR(Item=\"\",Qty=\"\"),\"\",Qty*VLOOKUP(Item,Food,Database!I$1,FALSE))","v":0},{"$f":"IF(OR(Item=\"\",Qty=\"\"),\"\",Qty*VLOOKUP(Item,Food,Database!J$1,FALSE))","v":0},{"$f":"IF(OR(Item=\"\",Qty=\"\"),\"\",Qty*VLOOKUP(Item,Food,Database!K$1,FALSE))","v":0},{"$f":"IF(OR(Item=\"\",Qty=\"\"),\"\",Qty*VLOOKUP(Item,Food,Database!L$1,FALSE))","v":0},{"$f":"IF(OR(Item=\"\",Qty=\"\"),\"\",Qty*VLOOKUP(Item,Food,Database!M$1,FALSE))","v":0},{"$f":"IF(OR(Item=\"\",Qty=\"\"),\"\",Qty*VLOOKUP(Item,Food,Database!N$1,FALSE))","v":0},{"$f":"IF(OR(Item=\"\",Qty=\"\"),\"\",Qty*VLOOKUP(Item,Food,Database!O$1,FALSE))","v":0},{"$f":"IF(OR(Item=\"\",Qty=\"\"),\"\",Qty*VLOOKUP(Item,Food,Database!P$1,FALSE))","v":0},{"$f":"IF(OR(Item=\"\",Qty=\"\"),\"\",Qty*VLOOKUP(Item,Food,Database!Q$1,FALSE))","v":0},{"$f":"IF(OR(Item=\"\",Qty=\"\"),\"\",Qty*VLOOKUP(Item,Food,Database!R$1,FALSE))","v":0},{"$f":"IF(OR(Item=\"\",Qty=\"\"),\"\",Qty*VLOOKUP(Item,Food,Database!S$1,FALSE))","v":0}]
[null,null,null,null,null,null,null,{"$f":"IF(Item=\"\",\"\",VLOOKUP(Item,Food,Database!C$1,FALSE))","v":"1 scoop (44 g)"},{"$f":"IF(OR(Item=\"\",Qty=\"\"),\"\",Qty*VLOOKUP(Item,Food,Database!D$1,FALSE))","v":200},{"$f":"IF(OR(Item=\"\",Qty=\"\"),\"\",Qty*VLOOKUP(Item,Food,Database!E$1,FALSE))","v":54},{"$f":"IF(OR(Item=\"\",Qty=\"\"),\"\",Qty*VLOOKUP(Item,Food,Database!F$1,FALSE))","v":6},{"$f":"IF(OR(Item=\"\",Qty=\"\"),\"\",Qty*VLOOKUP(Item,Food,Database!G$1,FALSE))","v":2},{"$f":"IF(OR(Item=\"\",Qty=\"\"),\"\",Qty*VLOOKUP(Item,Food,Database!H$1,FALSE))","v":0},{"$f":"IF(OR(Item=\"\",Qty=\"\"),\"\",Qty*VLOOKUP(Item,Food,Database!I$1,FALSE))","v":0},{"$f":"IF(OR(Item=\"\",Qty=\"\"),\"\",Qty*VLOOKUP(Item,Food,Database!J$1,FALSE))","v":0},{"$f":"IF(OR(Item=\"\",Qty=\"\"),\"\",Qty*VLOOKUP(Item,Food,Database!K$1,FALSE))","v":55},{"$f":"IF(OR(Item=\"\",Qty=\"\"),\"\",Qty*VLOOKUP(Item,Food,Database!L$1,FALSE))","v":220},{"$f":"IF(OR(Item=\"\",Qty=\"\"),\"\",Qty*VLOOKUP(Item,Food,Database!M$1,FALSE))","v":170},{"$f":"IF(OR(Item=\"\",Qty=\"\"),\"\",Qty*VLOOKUP(Item,Food,Database!N$1,FALSE))","v":15},{"$f":"IF(OR(Item=\"\",Qty=\"\"),\"\",Qty*VLOOKUP(Item,Food,Database!O$1,FALSE))","v":5},{"$f":"IF(OR(Item=\"\",Qty=\"\"),\"\",Qty*VLOOKUP(Item,Food,Database!P$1,FALSE))","v":0},{"$f":"IF(OR(Item=\"\",Qty=\"\"),\"\",Qty*VLOOKUP(Item,Food,Database!Q$1,FALSE))","v":0},{"$f":"IF(OR(Item=\"\",Qty=\"\"),\"\",Qty*VLOOKUP(Item,Food,Database!R$1,FALSE))","v":2},{"$f":"IF(OR(Item=\"\",Qty=\"\"),\"\",Qty*VLOOKUP(Item,Food,Database!S$1,FALSE))","v":22}]
[null,null,null,null,null,null,null,{"$f":"IF(Item=\"\",\"\",VLOOKUP(Item,Food,Database!C$1,FALSE))","v":"1 cup (8 oz)"},{"$f":"IF(OR(Item=\"\",Qty=\"\"),\"\",Qty*VLOOKUP(Item,Food,Database!D$1,FALSE))","v":90},{"$f":"IF(OR(Item=\"\",Qty=\"\"),\"\",Qty*VLOOKUP(Item,Food,Database!E$1,FALSE))","v":0},{"$f":"IF(OR(Item=\"\",Qty=\"\"),\"\",Qty*VLOOKUP(Item,Food,Database!F$1,FALSE))","v":0},{"$f":"IF(OR(Item=\"\",Qty=\"\"),\"\",Qty*VLOOKUP(Item,Food,Database!G$1,FALSE))","v":0},{"$f":"IF(OR(Item=\"\",Qty=\"\"),\"\",Qty*VLOOKUP(Item,Food,Database!H$1,FALSE))","v":0},{"$f":"IF(OR(Item=\"\",Qty=\"\"),\"\",Qty*VLOOKUP(Item,Food,Database!I$1,FALSE))","v":0},{"$f":"IF(OR(Item=\"\",Qty=\"\"),\"\",Qty*VLOOKUP(Item,Food,Database!J$1,FALSE))","v":0},{"$f":"IF(OR(Item=\"\",Qty=\"\"),\"\",Qty*VLOOKUP(Item,Food,Database!K$1,FALSE))","v":4.9000000000000004},{"$f":"IF(OR(Item=\"\",Qty=\"\"),\"\",Qty*VLOOKUP(Item,Food,Database!L$1,FALSE))","v":125},{"$f":"IF(OR(Item=\"\",Qty=\"\"),\"\",Qty*VLOOKUP(Item,Food,Database!M$1,FALSE))","v":0},{"$f":"IF(OR(Item=\"\",Qty=\"\"),\"\",Qty*VLOOKUP(Item,Food,Database!N$1,FALSE))","v":13},{"$f":"IF(OR(Item=\"\",Qty=\"\"),\"\",Qty*VLOOKUP(Item,Food,Database!O$1,FALSE))","v":0},{"$f":"IF(OR(Item=\"\",Qty=\"\"),\"\",Qty*VLOOKUP(Item,Food,Database!P$1,FALSE))","v":0},{"$f":"IF(OR(Item=\"\",Qty=\"\"),\"\",Qty*VLOOKUP(Item,Food,Database!Q$1,FALSE))","v":0},{"$f":"IF(OR(Item=\"\",Qty=\"\"),\"\",Qty*VLOOKUP(Item,Food,Database!R$1,FALSE))","v":12},{"$f":"IF(OR(Item=\"\",Qty=\"\"),\"\",Qty*VLOOKUP(Item,Food,Database!S$1,FALSE))","v":8}]
{"$rows_left_out":80}